Reaction Details
TargetSteroid 17-alpha-hydroxylase/17,20 lyase
LigandBDBM50391846
Substrate/Competitorn/a
Meas. Tech.ChEMBL_1563721 (CHEMBL3783932)
IC50 20±n/a nM
Citation Huang, AJayaraman, LFura, AVite, GDTrainor, GLGottardis, MMSpires, TESpires, VMRizzo, CAObermeier, MTElzinga, PATodderud, GFan, YNewitt, JABeyer, SMZhu, YWarrack, BMGoodenough, AKTebben, AJDoweyko, AMGold, DLBalog, A Discovery of the Selective CYP17A1 Lyase Inhibitor BMS-351 for the Treatment of Prostate Cancer. ACS Med Chem Lett7:40-5 (2016) 
 
Steroid 17-alpha-hydroxylase/17,20 lyase
Name:Steroid 17-alpha-hydroxylase/17,20 lyase
Type:Enzyme
Mol. Mass.:57382.42
Organism:Homo sapiens (Human)
Description:E.coli expressing human CYP17
Residue:508
BDBM50391846
NameBDBM50391846
Synonyms:CHEMBL2147041 | US9133160, 31
TypeSmall organic molecule
Emp. Form.C15H12F3N3
Mol. Mass.291.2711
SMILESCc1ccncc1-c1cccc2n(CC(F)(F)F)cnc12