Reaction Details
TargetAmine oxidase [flavin-containing] B
LigandBDBM50140172
Substrate/Competitorn/a
Meas. Tech.ChEMBL_1563757 (CHEMBL3784058)
Ki 21500±n/a nM
Citation Badavath, VNBaysal, IUcar, GSinha, BNJayaprakash, V Monoamine Oxidase Inhibitory Activity of Novel Pyrazoline Analogues: Curcumin Based Design and Synthesis. ACS Med Chem Lett7:56-61 (2016) 
 
Amine oxidase [flavin-containing] B
Name:Amine oxidase [flavin-containing] B
Type:Protein
Mol. Mass.:58768.76
Organism:Homo sapiens (Human)
Description:P27338
Residue:520
BDBM50140172
NameBDBM50140172
Synonyms:CHEBI:3962 Curcumin | US9409845, Table 1, Compound 21: curcumin
TypeSmall organic molecule
Emp. Form.C21H20O6
Mol. Mass.368.3799
SMILESCOc1cc(\C=C\C(=O)CC(=O)\C=C\c2ccc(O)c(OC)c2)ccc1O