Reaction Details
TargetNon-receptor tyrosine-protein kinase TYK2
LigandBDBM50157881
Substrate/Competitorn/a
Meas. Tech.ChEBML_1565921
IC50>10000±n/a nM
Citation Fairhurst, RAMarsilje, THStutz, SBoos, ANiklaus, MChen, BJiang, SLu, WFuret, PMcCarthy, CStauffer, FGuagnano, VVaupel, AMichellys, PYSchnell, CJeay, S Optimisation of a 5-[3-phenyl-(2-cyclic-ether)-methyl-ether]-4-aminopyrrolopyrimidine series of IGF-1R inhibitors. Bioorg Med Chem Lett26:2057-64 (2016) 
 
Non-receptor tyrosine-protein kinase TYK2
Name:Non-receptor tyrosine-protein kinase TYK2
Type:Protein
Mol. Mass.:133666.03
Organism:Homo sapiens (Human)
Description:P29597
Residue:1187
BDBM50157881
NameBDBM50157881
Synonyms:CHEMBL3787614
TypeSmall organic molecule
Emp. Form.C25H31N5O2
Mol. Mass.433.5459
SMILESNc1ncnc2n(cc(-c3cccc(OC[C@@H]4CCCO4)c3)c12)[C@@H]1C[C@H](CN2CCC2)C1