Reaction Details
TargetInsulin-like growth factor 1 receptor
LigandBDBM50158508
Substrate/Competitorn/a
Meas. Tech.ChEMBL_1570071 (CHEMBL3789673)
IC50 12±n/a nM
Citation Fairhurst, RAMarsilje, THStutz, SBoos, ANiklaus, MChen, BJiang, SLu, WFuret, PMcCarthy, CStauffer, FGuagnano, VVaupel, AMichellys, PYSchnell, CJeay, S Optimisation of a 5-[3-phenyl-(2-cyclic-ether)-methyl-ether]-4-aminopyrrolopyrimidine series of IGF-1R inhibitors. Bioorg Med Chem Lett26:2057-64 (2016) 
 
Insulin-like growth factor 1 receptor
Name:Insulin-like growth factor 1 receptor
Type:Protein
Mol. Mass.:154776.79
Organism:Homo sapiens (Human)
Description:P08069
Residue:1367
BDBM50158508
NameBDBM50158508
Synonyms:CHEMBL3787271
TypeSmall organic molecule
Emp. Form.C29H35FN6O3
Mol. Mass.534.625
SMILESCC(=O)N1CCN(CC1)[C@H]1C[C@H](C1)n1cc(-c2cc(OCC34CCC(CC3)O4)ccc2F)c2c(N)ncnc12