Reaction Details
TargetEpidermal growth factor receptor
LigandBDBM50158429
Substrate/Competitorn/a
Meas. Tech.ChEMBL_1565887 (CHEMBL3789991)
IC50>10000±n/a nM
Citation Fairhurst, RAMarsilje, THStutz, SBoos, ANiklaus, MChen, BJiang, SLu, WFuret, PMcCarthy, CStauffer, FGuagnano, VVaupel, AMichellys, PYSchnell, CJeay, S Optimisation of a 5-[3-phenyl-(2-cyclic-ether)-methyl-ether]-4-aminopyrrolopyrimidine series of IGF-1R inhibitors. Bioorg Med Chem Lett26:2057-64 (2016) 
 
Epidermal growth factor receptor
Name:Epidermal growth factor receptor
Type:Receptor Kinase Domain
Mol. Mass.:134279.59
Organism:Homo sapiens (Human)
Description:P00533
Residue:1210
BDBM50158429
NameBDBM50158429
Synonyms:CHEMBL3785500
TypeSmall organic molecule
Emp. Form.C27H33N5O2
Mol. Mass.459.5832
SMILESNc1ncnc2n(cc(-c3cccc(OCC45CCC(CC4)O5)c3)c12)[C@@H]1C[C@H](CN2CCC2)C1