Reaction Details
TargetInsulin-like growth factor 1 receptor
LigandBDBM50158430
Substrate/Competitorn/a
Meas. Tech.ChEMBL_1570071 (CHEMBL3789673)
IC50 64±n/a nM
Citation Fairhurst, RAMarsilje, THStutz, SBoos, ANiklaus, MChen, BJiang, SLu, WFuret, PMcCarthy, CStauffer, FGuagnano, VVaupel, AMichellys, PYSchnell, CJeay, S Optimisation of a 5-[3-phenyl-(2-cyclic-ether)-methyl-ether]-4-aminopyrrolopyrimidine series of IGF-1R inhibitors. Bioorg Med Chem Lett26:2057-64 (2016) 
 
Insulin-like growth factor 1 receptor
Name:Insulin-like growth factor 1 receptor
Type:Protein
Mol. Mass.:154776.79
Organism:Homo sapiens (Human)
Description:P08069
Residue:1367
BDBM50158430
NameBDBM50158430
Synonyms:CHEMBL3786634
TypeSmall organic molecule
Emp. Form.C28H35N5O3S
Mol. Mass.521.674
SMILESNc1ncnc2n(cc(-c3cccc(OCC45CCC(CC4)O5)c3)c12)[C@@H]1C[C@H](CN2CC[S+]([O-])CC2)C1