Reaction Details
TargetAurora kinase A
LigandBDBM50156383
Substrate/Competitorn/a
Meas. Tech.ChEMBL_1565871 (CHEMBL3789975)
IC50>10000±n/a nM
Citation Fairhurst, RAMarsilje, THStutz, SBoos, ANiklaus, MChen, BJiang, SLu, WFuret, PMcCarthy, CStauffer, FGuagnano, VVaupel, AMichellys, PYSchnell, CJeay, S Optimisation of a 5-[3-phenyl-(2-cyclic-ether)-methyl-ether]-4-aminopyrrolopyrimidine series of IGF-1R inhibitors. Bioorg Med Chem Lett26:2057-64 (2016) 
 
Aurora kinase A
Name:Aurora kinase A
Type:Serine/threonine-protein kinase
Mol. Mass.:45830.98
Organism:Homo sapiens (Human)
Description:O14965
Residue:403
BDBM50156383
NameBDBM50156383
Synonyms:CHEMBL3785951
TypeSmall organic molecule
Emp. Form.C27H33FN6O3
Mol. Mass.508.5877
SMILESCC(=O)N1CCN(CC1)[C@H]1C[C@H](C1)n1cc(-c2cc(OC[C@@H]3CCCO3)ccc2F)c2c(N)ncnc12