Reaction Details
TargetInsulin-like growth factor 1 receptor
LigandBDBM50158505
Substrate/Competitorn/a
Meas. Tech.ChEMBL_1570072 (CHEMBL3789674)
IC50 7.3±n/a nM
Citation Fairhurst, RAMarsilje, THStutz, SBoos, ANiklaus, MChen, BJiang, SLu, WFuret, PMcCarthy, CStauffer, FGuagnano, VVaupel, AMichellys, PYSchnell, CJeay, S Optimisation of a 5-[3-phenyl-(2-cyclic-ether)-methyl-ether]-4-aminopyrrolopyrimidine series of IGF-1R inhibitors. Bioorg Med Chem Lett26:2057-64 (2016) 
 
Insulin-like growth factor 1 receptor
Name:Insulin-like growth factor 1 receptor
Type:Protein
Mol. Mass.:154776.79
Organism:Homo sapiens (Human)
Description:P08069
Residue:1367
BDBM50158505
NameBDBM50158505
Synonyms:CHEMBL3786100
TypeSmall organic molecule
Emp. Form.C28H34FN5O3S
Mol. Mass.539.665
SMILESNc1ncnc2n(cc(-c3cc(OCC45CCC(CC4)O5)ccc3F)c12)[C@@H]1C[C@H](CN2CC[S+]([O-])CC2)C1