Reaction Details
TargetReceptor tyrosine-protein kinase erbB-4
LigandBDBM50156383
Substrate/Competitorn/a
Meas. Tech.ChEMBL_1565879 (CHEMBL3789983)
IC50>10000±n/a nM
Citation Fairhurst, RAMarsilje, THStutz, SBoos, ANiklaus, MChen, BJiang, SLu, WFuret, PMcCarthy, CStauffer, FGuagnano, VVaupel, AMichellys, PYSchnell, CJeay, S Optimisation of a 5-[3-phenyl-(2-cyclic-ether)-methyl-ether]-4-aminopyrrolopyrimidine series of IGF-1R inhibitors. Bioorg Med Chem Lett26:2057-64 (2016) 
 
Receptor tyrosine-protein kinase erbB-4
Name:Receptor tyrosine-protein kinase erbB-4
Type:Protein
Mol. Mass.:146803.56
Organism:Homo sapiens (Human)
Description:Q15303
Residue:1308
BDBM50156383
NameBDBM50156383
Synonyms:CHEMBL3785951
TypeSmall organic molecule
Emp. Form.C27H33FN6O3
Mol. Mass.508.5877
SMILESCC(=O)N1CCN(CC1)[C@H]1C[C@H](C1)n1cc(-c2cc(OC[C@@H]3CCCO3)ccc2F)c2c(N)ncnc12