Reaction Details
TargetEpidermal growth factor receptor
LigandBDBM50157358
Substrate/Competitorn/a
Meas. Tech.ChEMBL_1563973 (CHEMBL3784892)
Ki 37±n/a nM
Citation Bryan, MCBurdick, DJChan, BKChen, YClausen, SDotson, JEigenbrot, CElliott, RHanan, EJHeald, RJackson, PLa, HLainchbury, MMalek, SMann, SEPurkey, HESchaefer, GSchmidt, SSeward, ESideris, SWang, SYen, IYu, CHeffron, TP Pyridones as Highly Selective, Noncovalent Inhibitors of T790M Double Mutants of EGFR. ACS Med Chem Lett7:100-4 (2016) 
 
Epidermal growth factor receptor
Name:Epidermal growth factor receptor
Type:Receptor Kinase Domain
Mol. Mass.:134279.59
Organism:Homo sapiens (Human)
Description:P00533
Residue:1210
BDBM50157358
NameBDBM50157358
Synonyms:CHEMBL3780553
TypeSmall organic molecule
Emp. Form.C25H28ClN5O2
Mol. Mass.465.975
SMILESCN1CCN(CC1)c1ccc(NC(=O)c2c(NCCc3ccc(Cl)cc3)cc[nH]c2=O)cc1