Reaction Details
TargetChromobox protein homolog 1
LigandBDBM50155932
Substrate/Competitorn/a
Meas. Tech.ChEBML_1565743
Kd 78400±n/a nM
Citation Milosevich, NGignac, MCMcFarlane, JSimhadri, CHorvath, SDaze, KDCroft, CSDheri, AQuon, TTDouglas, SFWulff, JEPaci, IHof, F Selective Inhibition of CBX6: A Methyllysine Reader Protein in the Polycomb Family. ACS Med Chem Lett7:139-44 (2016) 
 
Chromobox protein homolog 1
Name:Chromobox protein homolog 1
Type:PROTEIN
Mol. Mass.:21405.43
Organism:Homo sapiens (Human)
Description:ChEMBL_103989
Residue:185
BDBM50155932
NameBDBM50155932
Synonyms:CHEMBL3780489
TypeSmall organic molecule
Emp. Form.C74H87BrN11O17S
Mol. Mass.1514.515
SMILESCC(C)[C@H](NC(=O)[C@H](Cc1ccccc1)NC(=O)c1ccc(Br)cc1)C(=O)N[C@@H](Cc1ccc(O)cc1)C(=O)N[C@@H](CCCC[N+](C)(C)C)C(=O)N[C@@H](CO)C(=O)N[C@@H](CCC(O)=O)C(=O)N[C@@H](CCCCNC(=S)Nc1ccc(c(c1)C(O)=O)-c1c2ccc(O)cc2oc2cc(=O)ccc12)C(N)=O