Reaction Details
TargetChromobox protein homolog 6
LigandBDBM50157395
Substrate/Competitorn/a
Meas. Tech.ChEMBL_1565748 (CHEMBL3782546)
Kd 110±n/a nM
Citation Milosevich, NGignac, MCMcFarlane, JSimhadri, CHorvath, SDaze, KDCroft, CSDheri, AQuon, TTDouglas, SFWulff, JEPaci, IHof, F Selective Inhibition of CBX6: A Methyllysine Reader Protein in the Polycomb Family. ACS Med Chem Lett7:139-44 (2016) 
 
Chromobox protein homolog 6
Name:Chromobox protein homolog 6
Type:PROTEIN
Mol. Mass.:43924.51
Organism:Homo sapiens (Human)
Description:ChEMBL_116765
Residue:412
BDBM50157395
NameBDBM50157395
Synonyms:CHEMBL3780663
TypeSmall organic molecule
Emp. Form.C61H86BrN12O14S
Mol. Mass.1323.376
SMILES[H][C@]12CS[C@@H](CCCCC(=O)NCCCC[C@H](NC(=O)[C@H](CCC(O)=O)NC(=O)[C@H](CO)NC(=O)[C@H](CCCC[N+](C)(C)C)NC(=O)[C@H](Cc3ccc(O)cc3)NC(=O)[C@H](C)NC(=O)[C@H](Cc3ccccc3)NC(=O)c3ccc(Br)cc3)C(N)=O)[C@@]1([H])NC(=O)N2