Reaction Details
TargetBromodomain-containing protein 4
LigandBDBM50156118
Substrate/Competitorn/a
Meas. Tech.ChEMBL_1569661 (CHEMBL3791134)
IC50<14±n/a nM
Citation Romero, FATaylor, AMCrawford, TDTsui, VCôté, AMagnuson, S Disrupting Acetyl-Lysine Recognition: Progress in the Development of Bromodomain Inhibitors. J Med Chem59:1271-98 (2016) 
 
Bromodomain-containing protein 4
Name:Bromodomain-containing protein 4
Type:Protein
Mol. Mass.:152264.84
Organism:Homo sapiens (Human)
Description:O60885
Residue:1362
BDBM50156118
NameBDBM50156118
Synonyms:CHEMBL3785327
TypeSmall organic molecule
Emp. Form.C22H18N4O2
Mol. Mass.370.4039
SMILESCc1noc(C)c1-c1cc(-c2c(C)ccc3ncccc23)c2[nH]c(=O)[nH]c2c1