Reaction Details
TargetBromodomain and PHD finger-containing protein 3
LigandBDBM50148549
Substrate/Competitorn/a
Meas. Tech.ChEBML_1569649
Kd 2400±n/a nM
Citation Romero, FATaylor, AMCrawford, TDTsui, VCôté, AMagnuson, S Disrupting Acetyl-Lysine Recognition: Progress in the Development of Bromodomain Inhibitors. J Med Chem59:1271-98 (2016) 
 
Bromodomain and PHD finger-containing protein 3
Name:Bromodomain and PHD finger-containing protein 3
Type:PROTEIN
Mol. Mass.:135743.95
Organism:Homo sapiens (Human)
Description:ChEMBL_108004
Residue:1205
BDBM50148549
NameBDBM50148549
Synonyms:4-Bromo-N-(2,3-dihydro-6-methoxy-1,3-dimethyl-2-oxo-1H-benzimidazol-5-yl)-2-methyl-benzenesulfonamide CHEMBL3770173 OF-1
TypeSmall organic molecule
Emp. Form.C17H18BrN3O4S
Mol. Mass.440.312
SMILESCOc1cc2n(C)c(=O)n(C)c2cc1NS(=O)(=O)c1ccc(Br)cc1C