Reaction Details
TargetChromatin remodeling regulator CECR2
LigandBDBM50157606
Substrate/Competitorn/a
Meas. Tech.ChEBML_1569640
Kd 80±n/a nM
Citation Romero, FATaylor, AMCrawford, TDTsui, VCôté, AMagnuson, S Disrupting Acetyl-Lysine Recognition: Progress in the Development of Bromodomain Inhibitors. J Med Chem59:1271-98 (2016) 
 
Chromatin remodeling regulator CECR2
Name:Chromatin remodeling regulator CECR2
Type:PROTEIN
Mol. Mass.:164223.89
Organism:Homo sapiens (Human)
Description:ChEMBL_107999
Residue:1484
BDBM50157606
NameBDBM50157606
Synonyms:CHEMBL3785432
TypeSmall organic molecule
Emp. Form.C27H37N5O2S
Mol. Mass.495.68
SMILESCCCS(=O)(=O)c1nc(NC2CC2)cc(n1)-c1ccc2n(ccc2c1)C1CC(C)(C)NC(C)(C)C1