Reaction Details
TargetBromodomain-containing protein 9
LigandBDBM50157607
Substrate/Competitorn/a
Meas. Tech.ChEBML_1569639
Kd 99±n/a nM
Citation Romero, FATaylor, AMCrawford, TDTsui, VCôté, AMagnuson, S Disrupting Acetyl-Lysine Recognition: Progress in the Development of Bromodomain Inhibitors. J Med Chem59:1271-98 (2016) 
 
Bromodomain-containing protein 9
Name:Bromodomain-containing protein 9
Type:PROTEIN
Mol. Mass.:66994.30
Organism:Homo sapiens (Human)
Description:ChEMBL_108000
Residue:597
BDBM50157607
NameBDBM50157607
Synonyms:CHEMBL3753082 | US11773085, Compound B24
TypeSmall organic molecule
Emp. Form.C26H30ClN3O4S
Mol. Mass.516.052
SMILESCC(C)CS(=O)(=O)N[C@H]1CCC(=O)N([C@@H]1c1ccc(Cl)cc1)c1ccc2c(C)cc(=O)n(C)c2c1