Reaction Details
TargetPeregrin
LigandBDBM50157570
Substrate/Competitorn/a
Meas. Tech.ChEMBL_1569647 (CHEMBL3790873)
Kd 31±n/a nM
Citation Romero, FATaylor, AMCrawford, TDTsui, VCôté, AMagnuson, S Disrupting Acetyl-Lysine Recognition: Progress in the Development of Bromodomain Inhibitors. J Med Chem59:1271-98 (2016) 
 
Peregrin
Name:Peregrin
Type:PROTEIN
Mol. Mass.:137524.47
Organism:Homo sapiens (Human)
Description:ChEMBL_108054
Residue:1214
BDBM50157570
NameBDBM50157570
Synonyms:4-cyano-N-(1,3-dimethyl-2-oxoquinolin-6-yl)-2-methoxybenzenesulfonamide D0O6XT NI 57 US11773085, Compound B26
TypeSmall organic molecule
Emp. Form.C19H17N3O4S
Mol. Mass.383.421
SMILESCOc1cc(ccc1S(=O)(=O)Nc1ccc2n(C)c(=O)c(C)cc2c1)C#N