Reaction Details
TargetBromodomain-containing protein 1
LigandBDBM50148549
Substrate/Competitorn/a
Meas. Tech.ChEMBL_1569648 (CHEMBL3790874)
Kd 500±n/a nM
Citation Romero, FATaylor, AMCrawford, TDTsui, VCôté, AMagnuson, S Disrupting Acetyl-Lysine Recognition: Progress in the Development of Bromodomain Inhibitors. J Med Chem59:1271-98 (2016) 
 
Bromodomain-containing protein 1
Name:Bromodomain-containing protein 1
Type:PROTEIN
Mol. Mass.:119557.65
Organism:Homo sapiens (Human)
Description:ChEMBL_105349
Residue:1058
BDBM50148549
NameBDBM50148549
Synonyms:4-Bromo-N-(2,3-dihydro-6-methoxy-1,3-dimethyl-2-oxo-1H-benzimidazol-5-yl)-2-methyl-benzenesulfonamide CHEMBL3770173 OF-1
TypeSmall organic molecule
Emp. Form.C17H18BrN3O4S
Mol. Mass.440.312
SMILESCOc1cc2n(C)c(=O)n(C)c2cc1NS(=O)(=O)c1ccc(Br)cc1C