Reaction Details
TargetPeregrin
LigandBDBM50032927
Substrate/Competitorn/a
Meas. Tech.ChEMBL_1569647 (CHEMBL3790873)
Kd 13±n/a nM
Citation Romero, FATaylor, AMCrawford, TDTsui, VCôté, AMagnuson, S Disrupting Acetyl-Lysine Recognition: Progress in the Development of Bromodomain Inhibitors. J Med Chem59:1271-98 (2016) 
 
Peregrin
Name:Peregrin
Type:PROTEIN
Mol. Mass.:137524.47
Organism:Homo sapiens (Human)
Description:ChEMBL_108054
Residue:1214
BDBM50032927
NameBDBM50032927
Synonyms:CHEMBL3356143 PFI 4 PFI4
TypeSmall organic molecule
Emp. Form.C21H24N4O3
Mol. Mass.380.4403
SMILESCOc1ccccc1C(=O)Nc1cc2n(C)c(=O)n(C)c2cc1N1CCCC1