Reaction Details
TargetHepatocyte growth factor receptor
LigandBDBM50157535
Substrate/Competitorn/a
Meas. Tech.ChEMBL_1568316 (CHEMBL3788750)
IC50 1±n/a nM
Citation Boezio, AACopeland, KWRex, KK Albrecht, BBauer, DBellon, SFBoezio, CBroome, MAChoquette, DCoxon, ADussault, IHirai, SLewis, RLin, MHLohman, JLiu, JPeterson, EAPotashman, MShimanovich, RTeffera, YWhittington, DAVaida, KRHarmange, JC Discovery of (R)-6-(1-(8-Fluoro-6-(1-methyl-1H-pyrazol-4-yl)-[1,2,4]triazolo[4,3-a]pyridin-3-yl)ethyl)-3-(2-methoxyethoxy)-1,6-naphthyridin-5(6H)-one (AMG 337), a Potent and Selective Inhibitor of MET with High Unbound Target Coverage and Robust In Vivo Antitumor Activity. J Med Chem59:2328-42 (2016) 
 
Hepatocyte growth factor receptor
Name:Hepatocyte growth factor receptor
Type:Protein
Mol. Mass.:155559.73
Organism:Homo sapiens (Human)
Description:P08581
Residue:1390
BDBM50157535
NameBDBM50157535
Synonyms:CHEMBL3787004
TypeSmall organic molecule
Emp. Form.C21H18FN7O2
Mol. Mass.419.4117
SMILESCOc1cnc2ccn([C@H](C)c3nnc4c(F)cc(cn34)-c3cnn(C)c3)c(=O)c2c1