Reaction Details
TargetCytochrome P450 26B1
LigandBDBM50157718
Substrate/Competitorn/a
Meas. Tech.ChEMBL_1567868 (CHEMBL3789263)
IC50 4400±n/a nM
Citation Diaz, PHuang, WKeyari, CMButtrick, BPrice, LGuilloteau, NTripathy, SSperandio, VGFronczek, FRAstruc-Diaz, FIsoherranen, N Development and Characterization of Novel and Selective Inhibitors of Cytochrome P450 CYP26A1, the Human Liver Retinoic Acid Hydroxylase. J Med Chem59:2579-95 (2016) 
 
Cytochrome P450 26B1
Name:Cytochrome P450 26B1
Type:PROTEIN
Mol. Mass.:57525.03
Organism:Homo sapiens (Human)
Description:ChEMBL_115648
Residue:512
BDBM50157718
NameBDBM50157718
Synonyms:CHEMBL3785701
TypeSmall organic molecule
Emp. Form.C26H30O2S2
Mol. Mass.438.645
SMILESCC1(C)CCC(C)(C)c2cc(ccc12)C1(SCCS1)c1ccc(\C=C\C(O)=O)cc1