Reaction Details
TargetCytochrome P450 26B1
LigandBDBM50033066
Substrate/Competitorn/a
Meas. Tech.ChEMBL_1567868 (CHEMBL3789263)
IC50>25000±n/a nM
Citation Diaz, PHuang, WKeyari, CMButtrick, BPrice, LGuilloteau, NTripathy, SSperandio, VGFronczek, FRAstruc-Diaz, FIsoherranen, N Development and Characterization of Novel and Selective Inhibitors of Cytochrome P450 CYP26A1, the Human Liver Retinoic Acid Hydroxylase. J Med Chem59:2579-95 (2016) 
 
Cytochrome P450 26B1
Name:Cytochrome P450 26B1
Type:PROTEIN
Mol. Mass.:57525.03
Organism:Homo sapiens (Human)
Description:ChEMBL_115648
Residue:512
BDBM50033066
NameBDBM50033066
Synonyms:4-(5,5,8,8-Tetramethyl-5,6,7,8-tetrahydro-naphthalene-2-carbonyl)-benzoic acid | CHEMBL101308
TypeSmall organic molecule
Emp. Form.C22H24O3
Mol. Mass.336.4242
SMILESCC1(C)CCC(C)(C)c2cc(ccc12)C(=O)c1ccc(cc1)C(O)=O