Reaction Details
TargetCytochrome P450 26B1
LigandBDBM50157730
Substrate/Competitorn/a
Meas. Tech.ChEMBL_1567868 (CHEMBL3789263)
IC50>5000±n/a nM
Citation Diaz, PHuang, WKeyari, CMButtrick, BPrice, LGuilloteau, NTripathy, SSperandio, VGFronczek, FRAstruc-Diaz, FIsoherranen, N Development and Characterization of Novel and Selective Inhibitors of Cytochrome P450 CYP26A1, the Human Liver Retinoic Acid Hydroxylase. J Med Chem59:2579-95 (2016) 
 
Cytochrome P450 26B1
Name:Cytochrome P450 26B1
Type:PROTEIN
Mol. Mass.:57525.03
Organism:Homo sapiens (Human)
Description:ChEMBL_115648
Residue:512
BDBM50157730
NameBDBM50157730
Synonyms:CHEMBL3785557
TypeSmall organic molecule
Emp. Form.C22H26O4S
Mol. Mass.386.504
SMILESCC1(C)CCC(C)(C)c2cc(ccc12)S(=O)(=O)c1ccc(CC(O)=O)cc1