Reaction Details
TargetCytochrome P450 26B1
LigandBDBM50253810
Substrate/Competitorn/a
Meas. Tech.ChEMBL_1567868 (CHEMBL3789263)
IC50 0.460000±n/a nM
Citation Diaz, PHuang, WKeyari, CMButtrick, BPrice, LGuilloteau, NTripathy, SSperandio, VGFronczek, FRAstruc-Diaz, FIsoherranen, N Development and Characterization of Novel and Selective Inhibitors of Cytochrome P450 CYP26A1, the Human Liver Retinoic Acid Hydroxylase. J Med Chem59:2579-95 (2016) 
 
Cytochrome P450 26B1
Name:Cytochrome P450 26B1
Type:PROTEIN
Mol. Mass.:57525.03
Organism:Homo sapiens (Human)
Description:ChEMBL_115648
Residue:512
BDBM50253810
NameBDBM50253810
Synonyms:CHEMBL459505 R-115866 US9963439, Talarozole
TypeSmall organic molecule
Emp. Form.C21H23N5S
Mol. Mass.377.506
SMILESCCC(CC)C(c1ccc(Nc2nc3ccccc3s2)cc1)n1cncn1