Reaction Details
TargetCytochrome P450 26A1
LigandBDBM50157724
Substrate/Competitorn/a
Meas. Tech.ChEMBL_1567869 (CHEMBL3789264)
IC50 4000±n/a nM
Citation Diaz, PHuang, WKeyari, CMButtrick, BPrice, LGuilloteau, NTripathy, SSperandio, VGFronczek, FRAstruc-Diaz, FIsoherranen, N Development and Characterization of Novel and Selective Inhibitors of Cytochrome P450 CYP26A1, the Human Liver Retinoic Acid Hydroxylase. J Med Chem59:2579-95 (2016) 
 
Cytochrome P450 26A1
Name:Cytochrome P450 26A1
Type:Enzyme
Mol. Mass.:56216.16
Organism:Homo sapiens (Human)
Description:O43174
Residue:497
BDBM50157724
NameBDBM50157724
Synonyms:CHEMBL3787564 | US9963439, Compound B
TypeSmall organic molecule
Emp. Form.C23H26O4
Mol. Mass.366.4501
SMILESCC1(C)CCC(C)(C)c2cc(ccc12)C(=O)COc1ccc(cc1)C(O)=O