Reaction Details
TargetDihydrofolate reductase
LigandBDBM50157638
Substrate/Competitorn/a
Meas. Tech.ChEBML_1567918
Ki 5.8±n/a nM
Citation Kaur, JKaur, SSingh, P Rational modification of the lead molecule: Enhancement in the anticancer and dihydrofolate reductase inhibitory activity. Bioorg Med Chem Lett26:1936-40 (2016) 
 
Dihydrofolate reductase
Name:Dihydrofolate reductase
Type:Enzyme
Mol. Mass.:21453.99
Organism:Homo sapiens (Human)
Description:Recombinant human DHFR.
Residue:187
BDBM50157638
NameBDBM50157638
Synonyms:CHEMBL3787137
TypeSmall organic molecule
Emp. Form.C37H28N4O3
Mol. Mass.576.6432
SMILESOC(Cn1cc(\C=C2/C(=O)Nc3ccccc23)c2ccccc12)Cn1cc(\C=C2/C(=O)Nc3ccccc23)c2ccccc12