Reaction Details
TargetSerine/threonine-protein kinase pim-1
LigandBDBM50005209
Substrate/Competitorn/a
Meas. Tech.ChEBML_1570460
Ki<1.000000±n/a nM
Citation Nishiguchi, GABurger, MTHan, WLan, JAtallah, GTamez, VLindvall, MBellamacina, CGarcia, PFeucht, PZavorotinskaya, TDai, YWong, K Design, synthesis and structure activity relationship of potent pan-PIM kinase inhibitors derived from the pyridyl carboxamide scaffold. Bioorg Med Chem Lett26:2328-32 (2016) 
 
Serine/threonine-protein kinase pim-1
Name:Serine/threonine-protein kinase pim-1
Type:Protein
Mol. Mass.:35681.82
Organism:Homo sapiens (Human)
Description:P11309
Residue:313
BDBM50005209
NameBDBM50005209
Synonyms:CHEMBL3103867
TypeSmall organic molecule
Emp. Form.C22H23FN6O
Mol. Mass.406.456
SMILESN[C@H]1CCCN(C1)c1ccncc1NC(=O)c1nc(ccc1N)-c1ccccc1F