Reaction Details
TargetSerine/threonine-protein kinase pim-1
LigandBDBM50156379
Substrate/Competitorn/a
Meas. Tech.ChEBML_1570460
Ki 3.0±n/a nM
Citation Nishiguchi, GABurger, MTHan, WLan, JAtallah, GTamez, VLindvall, MBellamacina, CGarcia, PFeucht, PZavorotinskaya, TDai, YWong, K Design, synthesis and structure activity relationship of potent pan-PIM kinase inhibitors derived from the pyridyl carboxamide scaffold. Bioorg Med Chem Lett26:2328-32 (2016) 
 
Serine/threonine-protein kinase pim-1
Name:Serine/threonine-protein kinase pim-1
Type:Protein
Mol. Mass.:35681.82
Organism:Homo sapiens (Human)
Description:P11309
Residue:313
BDBM50156379
NameBDBM50156379
Synonyms:CHEMBL3792474
TypeSmall organic molecule
Emp. Form.C21H16FN7O
Mol. Mass.401.3964
SMILESNc1cncc(n1)-c1ccncc1NC(=O)c1nc(ccc1N)-c1ccccc1F