Reaction Details
TargetSerine/threonine-protein kinase pim-1
LigandBDBM50161843
Substrate/Competitorn/a
Meas. Tech.ChEMBL_1570460 (CHEMBL3794687)
Ki<1±n/a nM
Citation Nishiguchi, GABurger, MTHan, WLan, JAtallah, GTamez, VLindvall, MBellamacina, CGarcia, PFeucht, PZavorotinskaya, TDai, YWong, K Design, synthesis and structure activity relationship of potent pan-PIM kinase inhibitors derived from the pyridyl carboxamide scaffold. Bioorg Med Chem Lett26:2328-32 (2016) 
 
Serine/threonine-protein kinase pim-1
Name:Serine/threonine-protein kinase pim-1
Type:Protein
Mol. Mass.:35681.82
Organism:Homo sapiens (Human)
Description:P11309
Residue:313
BDBM50161843
NameBDBM50161843
Synonyms:CHEMBL3794146
TypeSmall organic molecule
Emp. Form.C23H18F2N6O2
Mol. Mass.448.4248
SMILESCOc1cc(cc(N)n1)-c1ccncc1NC(=O)c1nc(ccc1N)-c1c(F)cccc1F