Reaction Details
TargetSerine/threonine-protein kinase pim-3
LigandBDBM50161839
Substrate/Competitorn/a
Meas. Tech.ChEMBL_1570462 (CHEMBL3794689)
Ki<3±n/a nM
Citation Nishiguchi, GABurger, MTHan, WLan, JAtallah, GTamez, VLindvall, MBellamacina, CGarcia, PFeucht, PZavorotinskaya, TDai, YWong, K Design, synthesis and structure activity relationship of potent pan-PIM kinase inhibitors derived from the pyridyl carboxamide scaffold. Bioorg Med Chem Lett26:2328-32 (2016) 
 
Serine/threonine-protein kinase pim-3
Name:Serine/threonine-protein kinase pim-3
Type:Protein
Mol. Mass.:35888.19
Organism:Homo sapiens (Human)
Description:Q86V86
Residue:326
BDBM50161839
NameBDBM50161839
Synonyms:CHEMBL3792736
TypeSmall organic molecule
Emp. Form.C19H13F3N8OS
Mol. Mass.458.42
SMILESNc1cc(nc(n1)C(F)(F)F)-c1ccncc1NC(=O)c1nc(ccc1N)-c1nccs1