Reaction Details
TargetSerine/threonine-protein kinase pim-2
LigandBDBM50162818
Substrate/Competitorn/a
Meas. Tech.ChEMBL_1570461 (CHEMBL3794688)
Ki<3±n/a nM
Citation Nishiguchi, GABurger, MTHan, WLan, JAtallah, GTamez, VLindvall, MBellamacina, CGarcia, PFeucht, PZavorotinskaya, TDai, YWong, K Design, synthesis and structure activity relationship of potent pan-PIM kinase inhibitors derived from the pyridyl carboxamide scaffold. Bioorg Med Chem Lett26:2328-32 (2016) 
 
Serine/threonine-protein kinase pim-2
Name:Serine/threonine-protein kinase pim-2
Type:Serine/threonine-protein kinase
Mol. Mass.:34185.93
Organism:Homo sapiens (Human)
Description:Q9P1W9
Residue:311
BDBM50162818
NameBDBM50162818
Synonyms:CHEMBL3793067
TypeSmall organic molecule
Emp. Form.C23H18F2N6O
Mol. Mass.432.4254
SMILESCc1cc(cc(N)n1)-c1ccncc1NC(=O)c1nc(ccc1N)-c1c(F)cccc1F