Reaction Details
TargetCytochrome P450 2B6
LigandBDBM50156671
Substrate/Competitorn/a
Meas. Tech.ChEMBL_1570736 (CHEMBL3795104)
IC50>40000±n/a nM
Citation Guo, JWatterson, SHSpergel, SHKempson, JLangevine, CMShen, DRYarde, MCvijic, MEBanas, DLiu, RSuchard, SJGillooly, KTaylor, TRex-Rabe, SShuster, DJMcIntyre, KWCornelius, GD'Arienzo, CMarino, ABalimane, PSalter-Cid, LMcKinnon, MBarrish, JCCarter, PHPitts, WJXie, JDyckman, AJ Identification and synthesis of potent and selective pyridyl-isoxazole based agonists of sphingosine-1-phosphate 1 (S1P1). Bioorg Med Chem Lett26:2470-4 (2016) 
 
Cytochrome P450 2B6
Name:Cytochrome P450 2B6
Type:Protein
Mol. Mass.:56289.75
Organism:Homo sapiens (Human)
Description:P20813
Residue:491
BDBM50156671
NameBDBM50156671
Synonyms:CHEMBL3794145
TypeSmall organic molecule
Emp. Form.C22H16F3N5O4
Mol. Mass.471.3887
SMILESOC(=O)C1CN(Cc2ccc(cc2)-c2noc(n2)-c2onc(c2C(F)(F)F)-c2ccccn2)C1