Reaction Details
TargetHistone deacetylase 1
LigandBDBM50156678
Substrate/Competitorn/a
Meas. Tech.ChEMBL_1571068 (CHEMBL3794854)
IC50 13805±n/a nM
Citation Yoo, JKim, SJSon, DSeo, HBaek, SYMaeng, CYLee, CKim, ISJung, YHLee, SMPark, HJ Computer-aided identification of new histone deacetylase 6 selective inhibitor with anti-sepsis activity. Eur J Med Chem116:126-135 (2016) 
 
Histone deacetylase 1
Name:Histone deacetylase 1
Type:Enzyme
Mol. Mass.:55090.27
Organism:Homo sapiens (Human)
Description:Q13547
Residue:482
BDBM50156678
NameBDBM50156678
Synonyms:CHEMBL3792392
TypeSmall organic molecule
Emp. Form.C15H16N2O2S
Mol. Mass.288.365
SMILESONC(=O)CCCc1csc(\C=C\c2ccccc2)n1