Reaction Details
TargetHistone deacetylase 9
LigandBDBM50446481
Substrate/Competitorn/a
Meas. Tech.ChEMBL_1571084 (CHEMBL3794870)
IC50 23.2±n/a nM
Citation Yoo, JKim, SJSon, DSeo, HBaek, SYMaeng, CYLee, CKim, ISJung, YHLee, SMPark, HJ Computer-aided identification of new histone deacetylase 6 selective inhibitor with anti-sepsis activity. Eur J Med Chem116:126-135 (2016) 
 
Histone deacetylase 9
Name:Histone deacetylase 9
Type:Enzyme
Mol. Mass.:111304.31
Organism:Homo sapiens (Human)
Description:Q9UKV0
Residue:1011
BDBM50446481
NameBDBM50446481
Synonyms:CHEMBL3110004 US10722597, Compound TMP-269
TypeSmall organic molecule
Emp. Form.C25H21F3N4O3S
Mol. Mass.514.519
SMILESFC(F)(F)c1nc(no1)-c1cccc(c1)C(=O)NCC1(CCOCC1)c1nc(cs1)-c1ccccc1