Reaction Details
TargetHistone deacetylase 11
LigandBDBM50156678
Substrate/Competitorn/a
Meas. Tech.ChEMBL_1571083 (CHEMBL3794869)
IC50 32800±n/a nM
Citation Yoo, JKim, SJSon, DSeo, HBaek, SYMaeng, CYLee, CKim, ISJung, YHLee, SMPark, HJ Computer-aided identification of new histone deacetylase 6 selective inhibitor with anti-sepsis activity. Eur J Med Chem116:126-135 (2016) 
 
Histone deacetylase 11
Name:Histone deacetylase 11
Type:Chromatin regulator; hydrolase; repressor
Mol. Mass.:39187.66
Organism:Homo sapiens (Human)
Description:Q96DB2
Residue:347
BDBM50156678
NameBDBM50156678
Synonyms:CHEMBL3792392
TypeSmall organic molecule
Emp. Form.C15H16N2O2S
Mol. Mass.288.365
SMILESONC(=O)CCCc1csc(\C=C\c2ccccc2)n1