Reaction Details
TargetRho-associated protein kinase 2
LigandBDBM50156734
Substrate/Competitorn/a
Meas. Tech.ChEMBL_1571376 (CHEMBL3796494)
Ki 1.8±n/a nM
Citation Sturdivant, JMRoyalty, SMLin, CWMoore, LAYingling, JDLaethem, CLSherman, BHeintzelman, GRKopczynski, CCdeLong, MA Discovery of the ROCK inhibitor netarsudil for the treatment of open-angle glaucoma. Bioorg Med Chem Lett26:2475-80 (2016) 
 
Rho-associated protein kinase 2
Name:Rho-associated protein kinase 2
Type:Protein
Mol. Mass.:160885.43
Organism:Homo sapiens (Human)
Description:O75116
Residue:1388
BDBM50156734
NameBDBM50156734
Synonyms:CHEMBL3793235
TypeSmall organic molecule
Emp. Form.C19H16F3N3O
Mol. Mass.359.345
SMILESNCC(C(=O)Nc1ccc2cnccc2c1)c1ccc(cc1)C(F)(F)F