Reaction Details
TargetD(2) dopamine receptor
LigandBDBM50156929
Substrate/Competitorn/a
Meas. Tech.ChEMBL_1571935 (CHEMBL3796327)
Ki>10000±n/a nM
Citation Witt, JOMcCollum, ALHurtado, MAHuseman, EDJeffries, DETemple, KJPlumley, HCBlobaum, ALLindsley, CWHopkins, CR Synthesis and characterization of a series of chiral alkoxymethyl morpholine analogs as dopamine receptor 4 (D4R) antagonists. Bioorg Med Chem Lett26:2481-8 (2016) 
 
D(2) dopamine receptor
Name:D(2) dopamine receptor
Type:Cell-surface receptors
Mol. Mass.:50647.10
Organism:Homo sapiens (Human)
Description:P14416
Residue:443
BDBM50156929
NameBDBM50156929
Synonyms:CHEMBL3794079
TypeSmall organic molecule
Emp. Form.C20H25NOS
Mol. Mass.327.484
SMILESCc1ccc(CN2CCO[C@H](CSc3ccccc3)C2)cc1C