Reaction Details
TargetD(2) dopamine receptor
LigandBDBM50156813
Substrate/Competitorn/a
Meas. Tech.ChEMBL_1571936 (CHEMBL3796328)
Ki>10000±n/a nM
Citation Witt, JOMcCollum, ALHurtado, MAHuseman, EDJeffries, DETemple, KJPlumley, HCBlobaum, ALLindsley, CWHopkins, CR Synthesis and characterization of a series of chiral alkoxymethyl morpholine analogs as dopamine receptor 4 (D4R) antagonists. Bioorg Med Chem Lett26:2481-8 (2016) 
 
D(2) dopamine receptor
Name:D(2) dopamine receptor
Type:Cell-surface receptors
Mol. Mass.:50647.10
Organism:Homo sapiens (Human)
Description:P14416
Residue:443
BDBM50156813
NameBDBM50156813
Synonyms:CHEMBL3792751
TypeSmall organic molecule
Emp. Form.C19H19ClFN3O2
Mol. Mass.375.824
SMILESFc1ccc2c(CN3CCO[C@H](COc4cccc(Cl)n4)C3)c[nH]c2c1