Reaction Details
TargetD(1B) dopamine receptor
LigandBDBM50156929
Substrate/Competitorn/a
Meas. Tech.ChEMBL_1571938 (CHEMBL3796396)
Ki>10000±n/a nM
Citation Witt, JOMcCollum, ALHurtado, MAHuseman, EDJeffries, DETemple, KJPlumley, HCBlobaum, ALLindsley, CWHopkins, CR Synthesis and characterization of a series of chiral alkoxymethyl morpholine analogs as dopamine receptor 4 (D4R) antagonists. Bioorg Med Chem Lett26:2481-8 (2016) 
 
D(1B) dopamine receptor
Name:D(1B) dopamine receptor
Type:Protein
Mol. Mass.:52943.41
Organism:Homo sapiens (Human)
Description:P21918
Residue:477
BDBM50156929
NameBDBM50156929
Synonyms:CHEMBL3794079
TypeSmall organic molecule
Emp. Form.C20H25NOS
Mol. Mass.327.484
SMILESCc1ccc(CN2CCO[C@H](CSc3ccccc3)C2)cc1C