Reaction Details
TargetD(4) dopamine receptor
LigandBDBM50156963
Substrate/Competitorn/a
Meas. Tech.ChEMBL_1571915 (CHEMBL3796307)
IC50 38±n/a nM
Citation Witt, JOMcCollum, ALHurtado, MAHuseman, EDJeffries, DETemple, KJPlumley, HCBlobaum, ALLindsley, CWHopkins, CR Synthesis and characterization of a series of chiral alkoxymethyl morpholine analogs as dopamine receptor 4 (D4R) antagonists. Bioorg Med Chem Lett26:2481-8 (2016) 
 
D(4) dopamine receptor
Name:D(4) dopamine receptor
Type:Enzyme
Mol. Mass.:48373.19
Organism:Homo sapiens (Human)
Description:P21917
Residue:419
BDBM50156963
NameBDBM50156963
Synonyms:CHEMBL3794199
TypeSmall organic molecule
Emp. Form.C18H19ClFNO2
Mol. Mass.335.8
SMILESFc1ccc(OC[C@@H]2CN(Cc3ccc(Cl)cc3)CCO2)cc1