Reaction Details
TargetD(4) dopamine receptor
LigandBDBM50156951
Substrate/Competitorn/a
Meas. Tech.ChEMBL_1571915 (CHEMBL3796307)
Ki 89±n/a nM
Citation Witt, JOMcCollum, ALHurtado, MAHuseman, EDJeffries, DETemple, KJPlumley, HCBlobaum, ALLindsley, CWHopkins, CR Synthesis and characterization of a series of chiral alkoxymethyl morpholine analogs as dopamine receptor 4 (D4R) antagonists. Bioorg Med Chem Lett26:2481-8 (2016) 
 
D(4) dopamine receptor
Name:D(4) dopamine receptor
Type:Enzyme
Mol. Mass.:48373.19
Organism:Homo sapiens (Human)
Description:P21917
Residue:419
BDBM50156951
NameBDBM50156951
Synonyms:CHEMBL3793072
TypeSmall organic molecule
Emp. Form.C19H19F4NO2
Mol. Mass.369.3533
SMILESFc1ccc(CN2CCO[C@H](COc3ccccc3)C2)cc1C(F)(F)F