Reaction Details
TargetD(4) dopamine receptor
LigandBDBM50156928
Substrate/Competitorn/a
Meas. Tech.ChEMBL_1571915 (CHEMBL3796307)
Ki 51±n/a nM
Citation Witt, JOMcCollum, ALHurtado, MAHuseman, EDJeffries, DETemple, KJPlumley, HCBlobaum, ALLindsley, CWHopkins, CR Synthesis and characterization of a series of chiral alkoxymethyl morpholine analogs as dopamine receptor 4 (D4R) antagonists. Bioorg Med Chem Lett26:2481-8 (2016) 
 
D(4) dopamine receptor
Name:D(4) dopamine receptor
Type:Enzyme
Mol. Mass.:48373.19
Organism:Homo sapiens (Human)
Description:P21917
Residue:419
BDBM50156928
NameBDBM50156928
Synonyms:CHEMBL3794375
TypeSmall organic molecule
Emp. Form.C19H20F3NO3
Mol. Mass.367.3622
SMILESFC(F)(F)Oc1ccc(CN2CCO[C@H](COc3ccccc3)C2)cc1