Reaction Details
TargetD(4) dopamine receptor
LigandBDBM50156925
Substrate/Competitorn/a
Meas. Tech.ChEMBL_1571915 (CHEMBL3796307)
Ki 160±n/a nM
Citation Witt, JOMcCollum, ALHurtado, MAHuseman, EDJeffries, DETemple, KJPlumley, HCBlobaum, ALLindsley, CWHopkins, CR Synthesis and characterization of a series of chiral alkoxymethyl morpholine analogs as dopamine receptor 4 (D4R) antagonists. Bioorg Med Chem Lett26:2481-8 (2016) 
 
D(4) dopamine receptor
Name:D(4) dopamine receptor
Type:Enzyme
Mol. Mass.:48373.19
Organism:Homo sapiens (Human)
Description:P21917
Residue:419
BDBM50156925
NameBDBM50156925
Synonyms:CHEMBL3792541
TypeSmall organic molecule
Emp. Form.C19H21N3O2
Mol. Mass.323.3889
SMILESC(Oc1ccccc1)[C@@H]1CN(Cc2cn3ccccc3n2)CCO1