Reaction Details
TargetD(4) dopamine receptor
LigandBDBM50156936
Substrate/Competitorn/a
Meas. Tech.ChEMBL_1571915 (CHEMBL3796307)
Ki 37±n/a nM
Citation Witt, JOMcCollum, ALHurtado, MAHuseman, EDJeffries, DETemple, KJPlumley, HCBlobaum, ALLindsley, CWHopkins, CR Synthesis and characterization of a series of chiral alkoxymethyl morpholine analogs as dopamine receptor 4 (D4R) antagonists. Bioorg Med Chem Lett26:2481-8 (2016) 
 
D(4) dopamine receptor
Name:D(4) dopamine receptor
Type:Enzyme
Mol. Mass.:48373.19
Organism:Homo sapiens (Human)
Description:P21917
Residue:419
BDBM50156936
NameBDBM50156936
Synonyms:CHEMBL3793906
TypeSmall organic molecule
Emp. Form.C20H21ClN2O2
Mol. Mass.356.846
SMILESClc1ccc2[nH]cc(CN3CCO[C@H](COc4ccccc4)C3)c2c1