Reaction Details
TargetD(4) dopamine receptor
LigandBDBM50156935
Substrate/Competitorn/a
Meas. Tech.ChEMBL_1571915 (CHEMBL3796307)
Ki 5.4±n/a nM
Citation Witt, JOMcCollum, ALHurtado, MAHuseman, EDJeffries, DETemple, KJPlumley, HCBlobaum, ALLindsley, CWHopkins, CR Synthesis and characterization of a series of chiral alkoxymethyl morpholine analogs as dopamine receptor 4 (D4R) antagonists. Bioorg Med Chem Lett26:2481-8 (2016) 
 
D(4) dopamine receptor
Name:D(4) dopamine receptor
Type:Enzyme
Mol. Mass.:48373.19
Organism:Homo sapiens (Human)
Description:P21917
Residue:419
BDBM50156935
NameBDBM50156935
Synonyms:CHEMBL3792805
TypeSmall organic molecule
Emp. Form.C21H24N2O3
Mol. Mass.352.4269
SMILESCOc1ccc2c(CN3CCO[C@H](COc4ccccc4)C3)c[nH]c2c1