Reaction Details
TargetALK tyrosine kinase receptor
LigandBDBM50159522
Substrate/Competitorn/a
Meas. Tech.ChEMBL_1568745 (CHEMBL3791910)
IC50 3±n/a nM
Citation Zhang, PDong, JZhong, BZhang, DYuan, HJin, CXu, XLi, HZhou, YLiang, ZJi, MXu, TSong, GZhang, LChen, GMeng, XSun, DShih, JZhang, RHou, GWang, CJin, YYang, Q Design and synthesis of novel 3-sulfonylpyrazol-4-amino pyrimidines as potent anaplastic lymphoma kinase (ALK) inhibitors. Bioorg Med Chem Lett26:1910-8 (2016) 
 
ALK tyrosine kinase receptor
Name:ALK tyrosine kinase receptor
Type:Protein
Mol. Mass.:176453.10
Organism:Homo sapiens (Human)
Description:Q9UM73
Residue:1620
BDBM50159522
NameBDBM50159522
Synonyms:CHEMBL3785711
TypeSmall organic molecule
Emp. Form.C27H38ClN7O3S
Mol. Mass.576.154
SMILESCC(C)CS(=O)(=O)c1nn(C)cc1Nc1nc(Nc2cc(C)c(cc2OC(C)C)C2CCNCC2)ncc1Cl