Reaction Details
TargetSerine protease hepsin
LigandBDBM50158151
Substrate/Competitorn/a
Meas. Tech.ChEMBL_1565753 (CHEMBL3782551)
Ki 720±n/a nM
Citation Venukadasula, PKOwusu, BYBansal, NRoss, LJHobrath, JVBao, DTruss, JWStackhouse, MMessick, TEKlampfer, LGalemmo, RA Design and Synthesis of Nonpeptide Inhibitors of Hepatocyte Growth Factor Activation. ACS Med Chem Lett7:177-81 (2016) 
 
Serine protease hepsin
Name:Serine protease hepsin
Type:Enzyme
Mol. Mass.:45016.98
Organism:Homo sapiens (Human)
Description:Human deglycosylated hepsin was expressed in Pichia pastoris.
Residue:417
BDBM50158151
NameBDBM50158151
Synonyms:CHEMBL3780273
TypeSmall organic molecule
Emp. Form.C25H34N6O3S
Mol. Mass.498.641
SMILESCS(=O)(=O)NC1CN(CC2CCN(Cc3ccccc3)CC2)C(=O)N(C1)c1cccc(c1)C(N)=N