Reaction Details
TargetCoagulation factor X
LigandBDBM50157632
Substrate/Competitorn/a
Meas. Tech.ChEMBL_1565757 (CHEMBL3782597)
Ki 380±n/a nM
Citation Venukadasula, PKOwusu, BYBansal, NRoss, LJHobrath, JVBao, DTruss, JWStackhouse, MMessick, TEKlampfer, LGalemmo, RA Design and Synthesis of Nonpeptide Inhibitors of Hepatocyte Growth Factor Activation. ACS Med Chem Lett7:177-81 (2016) 
 
Coagulation factor X
Name:Coagulation factor X
Type:Enzyme
Mol. Mass.:54726.60
Organism:Homo sapiens (Human)
Description:n/a
Residue:488
BDBM50157632
NameBDBM50157632
Synonyms:CHEMBL3781349
TypeSmall organic molecule
Emp. Form.C25H33N5O
Mol. Mass.419.5624
SMILESCC1CN(CC2CCN(Cc3ccccc3)CC2)C(=O)N(C1)c1cccc(c1)C(N)=N