Reaction Details
TargetCoagulation factor X
LigandBDBM50158159
Substrate/Competitorn/a
Meas. Tech.ChEMBL_1565757 (CHEMBL3782597)
Ki 180±n/a nM
Citation Venukadasula, PKOwusu, BYBansal, NRoss, LJHobrath, JVBao, DTruss, JWStackhouse, MMessick, TEKlampfer, LGalemmo, RA Design and Synthesis of Nonpeptide Inhibitors of Hepatocyte Growth Factor Activation. ACS Med Chem Lett7:177-81 (2016) 
 
Coagulation factor X
Name:Coagulation factor X
Type:Enzyme
Mol. Mass.:54726.60
Organism:Homo sapiens (Human)
Description:n/a
Residue:488
BDBM50158159
NameBDBM50158159
Synonyms:CHEMBL3780036
TypeSmall organic molecule
Emp. Form.C32H39N5O2
Mol. Mass.525.6844
SMILESNC(=N)c1cccc(c1)N1CC(COCc2ccccc2)CN(CC2CCN(Cc3ccccc3)CC2)C1=O