Reaction Details
TargetHepatocyte growth factor activator
LigandBDBM50158164
Substrate/Competitorn/a
Meas. Tech.ChEMBL_1565754 (CHEMBL3782552)
Ki 39600±n/a nM
Citation Venukadasula, PKOwusu, BYBansal, NRoss, LJHobrath, JVBao, DTruss, JWStackhouse, MMessick, TEKlampfer, LGalemmo, RA Design and Synthesis of Nonpeptide Inhibitors of Hepatocyte Growth Factor Activation. ACS Med Chem Lett7:177-81 (2016) 
 
Hepatocyte growth factor activator
Name:Hepatocyte growth factor activator
Type:PROTEIN
Mol. Mass.:70690.18
Organism:Homo sapiens (Human)
Description:ChEMBL_109514
Residue:655
BDBM50158164
NameBDBM50158164
Synonyms:CHEMBL3780039
TypeSmall organic molecule
Emp. Form.C25H33N5O
Mol. Mass.419.5624
SMILESCC1CN(Cc2ccc(cc2)C(N)=N)C(=O)N(C1)C1CCN(Cc2ccccc2)CC1